Videos sin sonido en mozilla (solucionado)

Imagen de virako
0 puntos

He estado buscando a ver si mi error lo habia tenido alguien mas, pero por mucho que he buscado, no encuentro nada. He intentao instalar los plugins para el mozilla, porque no se me escuchan los videos y eso, y desde synaptic, intente instalar java. Me ha salio un fallo de este tipo: E: emacs21-nox: el subproceso post-installation script devolvió el código de salida de error 1 E: cedet-common: problemas de dependencias - se deja sin configurar E: eieio: problemas de dependencias - se deja sin configurar E: speedbar: problemas de dependencias - se deja sin configurar E: emacs-extra: problemas de dependencias - se deja sin configurar E: emacs-nox: problemas de dependencias - se deja sin configurar y ahora cualquier cosa que intento instalar no me deja, me sale siempre este error, espero ayuda pronto, Gracias.

Imagen de tRaCk3r
+1
0
-1

prueba en un terminal:

sudo apt-get -f install

--
tRaCk3r
http://blog.cg-unit.com
ubuntu user #007044
linux user #319025
PC number #309252
Visita: http://www.clan-olla.org

+1
0
-1

 


tRaCk3r
http://tetosoft.com
ubuntu user #007044
linux user #319025
PC number #309252
Imagen de virako
+1
0
-1

He puesto en el el terminal lo que me has dicho y me ha salido lo siguiente:

Leyendo lista de paquetes... Hecho
Creando árbol de dependencias... Hecho
0 actualizados, 0 se instalarán, 0 para eliminar y 0 no actualizados.
6 no instalados del todo o eliminados.
Necesito descargar 0B de archivos.
Se utilizarán 0B de espacio de disco adicional después de desempaquetar.
Configurando emacs21-nox (21.4a-3ubuntu2) ...
emacs-install emacs21
install/cedet-common: Handling install for emacsen flavor emacs21
Loading 00debian-vars...
No /etc/mailname. Reverting to default...
Loading 50autoconf (source)...
Loading 50dictionaries-common (source)...
Loading debian-ispell...
Loading /var/cache/dictionaries-common/emacsen-ispell-default.el (source)...
Loading /var/cache/dictionaries-common/emacsen-ispell-dicts.el (source)...
Loading 50festival (source)...
Wrote /usr/share/emacs21/site-lisp/cedet-common/cedet-autogen.elc
Wrote /usr/share/emacs21/site-lisp/cedet-common/cedet-compat.elc
Wrote /usr/share/emacs21/site-lisp/cedet-common/cedet-edebug.elc
Wrote /usr/share/emacs21/site-lisp/cedet-common/cedet.elc
Wrote /usr/share/emacs21/site-lisp/cedet-common/cedet-loaddefs.elc
Wrote /usr/share/emacs21/site-lisp/cedet-common/cedet-load.elc
Wrote /usr/share/emacs21/site-lisp/cedet-common/ezimage.elc
Wrote /usr/share/emacs21/site-lisp/cedet-common/fame.elc
Wrote /usr/share/emacs21/site-lisp/cedet-common/inversion.elc
Wrote /usr/share/emacs21/site-lisp/cedet-common/mode-local.elc
Wrote /usr/share/emacs21/site-lisp/cedet-common/pprint.elc
Wrote /usr/share/emacs21/site-lisp/cedet-common/sformat.elc
Wrote /usr/share/emacs21/site-lisp/cedet-common/working.elc
Done
install/dictionaries-common: Byte-compiling for emacsen flavour emacs21
Wrote /usr/share/emacs21/site-lisp/dictionaries-common/debian-ispell.elc
Wrote /usr/share/emacs21/site-lisp/dictionaries-common/ispell.elc
Wrote /usr/share/emacs21/site-lisp/dictionaries-common/flyspell.elc
Done
install/emacs-extra: Handling install for emacsen flavor emacs21
Wrote /usr/share/emacs21/site-lisp/emacs-extra/emacs-extra.elc
Done
emacsen-common: Handling install of emacsen flavor emacs21
emacsen-common: byte-compiling for emacs21
Loading 00debian-vars (source)...
No /etc/mailname. Reverting to default...
Loading 50autoconf (source)...
Loading 50dictionaries-common (source)...
Loading debian-ispell...
Loading /var/cache/dictionaries-common/emacsen-ispell-default.el (source)...
Loading /var/cache/dictionaries-common/emacsen-ispell-dicts.el (source)...
Loading 50festival (source)...
Wrote /etc/emacs21/site-start.d/00debian-vars.elc
Wrote /usr/share/emacs21/site-lisp/debian-startup.elc
Done
install/speedbar: Handling install for emacsen flavor emacs21
Loading 00debian-vars...
No /etc/mailname. Reverting to default...
Loading 50autoconf (source)...
Loading 50dictionaries-common (source)...
Loading debian-ispell...
Loading /var/cache/dictionaries-common/emacsen-ispell-default.el (source)...
Loading /var/cache/dictionaries-common/emacsen-ispell-dicts.el (source)...
Loading 50festival (source)...
Source file `/usr/share/emacs21/site-lisp/speedbar/dframe.el' newer than byte-co mpiled file
Wrote /usr/share/emacs21/site-lisp/speedbar/bigclock.elc
Wrote /usr/share/emacs21/site-lisp/speedbar/dframe.elc
While compiling toplevel forms in file /usr/share/emacs21/site-lisp/speedbar/rpm .el:
!! Wrong type argument ((stringp nil))
While compiling toplevel forms in file /usr/share/emacs21/site-lisp/speedbar/sb- ant.el:
!! Wrong type argument ((stringp nil))
While compiling toplevel forms in file /usr/share/emacs21/site-lisp/speedbar/sb- gud.el:
!! Wrong type argument ((stringp nil))
While compiling toplevel forms in file /usr/share/emacs21/site-lisp/speedbar/sb- html.el:
!! Wrong type argument ((stringp nil))
While compiling toplevel forms in file /usr/share/emacs21/site-lisp/speedbar/sb- image.el:
!! Wrong type argument ((stringp nil))
While compiling toplevel forms in file /usr/share/emacs21/site-lisp/speedbar/sb- info.el:
!! Wrong type argument ((stringp nil))
Wrote /usr/share/emacs21/site-lisp/speedbar/sb-rmail.elc
While compiling toplevel forms in file /usr/share/emacs21/site-lisp/speedbar/sb- texinfo.el:
!! Wrong type argument ((stringp nil))
While compiling toplevel forms in file /usr/share/emacs21/site-lisp/speedbar/sb- w3.el:
!! Wrong type argument ((stringp nil))
While compiling toplevel forms in file /usr/share/emacs21/site-lisp/speedbar/spe edbar.el:
!! Wrong type argument ((stringp nil))
Wrote /usr/share/emacs21/site-lisp/speedbar/speedbar-loaddefs.elc
Wrote /usr/share/emacs21/site-lisp/speedbar/speedbar-load.elc
Done
emacs-install: /usr/lib/emacsen-common/packages/install/speedbar emacs21 failed at /usr/lib/emacsen-common/emacs-install line 28, line 6.
dpkg: error al procesar emacs21-nox (--configure):
el subproceso post-installation script devolvió el código de salida de error 1
dpkg: problemas de dependencias impiden la configuración de cedet-common:
cedet-common depende de emacs21 | emacsen; sin embargo:
el paquete emacs21 no está instalado.
el paquete emacs21-nox que provee emacs21 no está configurado todavía.
el paquete emacsen no está instalado.
el paquete emacs21 que provee emacsen no está instalado.
el paquete emacs21-nox que provee emacsen no está configurado todavía.
dpkg: error al procesar cedet-common (--configure):
problemas de dependencias - se deja sin configurar
dpkg: problemas de dependencias impiden la configuración de eieio:
eieio depende de emacs21 | emacsen; sin embargo:
el paquete emacs21 no está instalado.
el paquete emacs21-nox que provee emacs21 no está configurado todavía.
el paquete emacsen no está instalado.
el paquete emacs21 que provee emacsen no está instalado.
el paquete emacs21-nox que provee emacsen no está configurado todavía.
eieio depende de cedet-common; sin embargo:
el paquete cedet-common no está configurado todavía.
dpkg: error al procesar eieio (--configure):
problemas de dependencias - se deja sin configurar
dpkg: problemas de dependencias impiden la configuración de emacs-extra:
emacs-extra depende de emacs21 | emacsen; sin embargo:
el paquete emacs21 no está instalado.
el paquete emacs21-nox que provee emacs21 no está configurado todavía.
el paquete emacsen no está instalado.
el paquete emacs21 que provee emacsen no está instalado.
el paquete emacs21-nox que provee emacsen no está configurado todavía.
dpkg: error al procesar emacs-extra (--configure):
problemas de dependencias - se deja sin configurar
dpkg: problemas de dependencias impiden la configuración de emacs-nox:
emacs-nox depende de emacs21-nox; sin embargo:
el paquete emacs21-nox no está configurado todavía.
dpkg: error al procesar emacs-nox (--configure):
problemas de dependencias - se deja sin configurar
dpkg: problemas de dependencias impiden la configuración de speedbar:
speedbar depende de cedet-common; sin embargo:
el paquete cedet-common no está configurado todavía.
dpkg: error al procesar speedbar (--configure):
problemas de dependencias - se deja sin configurar
Se encontraron errores al procesar:
emacs21-nox
cedet-common
eieio
emacs-extra
emacs-nox
speedbar
E: Sub-process /usr/bin/dpkg returned an error code (1)

He vuelto a probar y siguen saliendo el fallo de antes despues de cada instalacion, espero que puedas ayudarme lo mas pronto posible, gracias.

+1
0
-1
Imagen de virako
+1
0
-1

Ahora ya no me sale el fallo cuado instalao algo, me metido en synaptic y desisntalado los paquetes speedbar y emacs21-nox, y ya no da fallo cuando instalo las cosas, pero quisiera saber esos paquetes para que sirven y si corre riesgo el sistema al desinstalarlo, gracias.

+1
0
-1