error compilando con make

Imagen de xusmen69
0 puntos

Hola a todos! Siempre que intento compilar lo que sea con make, me tira un error, Errror 2:

Por ejemplo:
make[2]: *** [/home/josep/qc-usb-messenger-1.8/qc-driver.o] Error 1
make[1]: *** [_module_/home/josep/qc-usb-messenger-1.8] Error 2
make[1]: se sale del directorio `/usr/src/linux-headers-2.6.31-14-generic'
make: *** [qcmessenger.ko] Error 2

Otro ejemplo:

make[2]: *** [/home/josep/pwc-10.0.12-rc1/pwc-if.o] Error 1
make[1]: *** [_module_/home/josep/pwc-10.0.12-rc1] Error 2
make[1]: se sale del directorio `/usr/src/linux-headers-2.6.31-14-generic'
make: *** [default] Error 2

Da igual lo que intente compilar.
Es un error del kernel? que puedo hacer?

Utilizo Ubuntu 9.10

Gracias a todos!

Imagen de CHuLoYo
+1
0
-1

Mira si tienes instalados los paquetes:

build-essential cmake g++

Son los compiladores esenciales . Puedes instalar los compiladores de kde qt4-qmake etc si los necesitas.

---------
Marcos Pérez

+1
0
-1
Imagen de xusmen69
+1
0
-1

Gracias por contestar Marcos, me tiene frito.
Buil-essential si lo tengo instalado, g++ creo que tambien, cmake no lo se seguro, estoy en clases, llegare a acasa en un rato, y nada mas llegue lo compruebo y te lo indico.
Saludos

+1
0
-1
Imagen de CHuLoYo
+1
0
-1

Doy por hecho que tienes los sources del kernel.

---------
Marcos Pérez

+1
0
-1
Imagen de xusmen69
+1
0
-1

te refieres a los paquetes linux-header correspondientes al kernel, no? si los tengo instalados, estoy instalando el cmake en este instante,a hora te comento...

+1
0
-1