Instalar D-LINK DWA-125 / 150

Imagen de nobody
0 puntos

Instalar DWA-150

esta es la forma mas fácil para instalar este wiffi, esto ya lo probé en ubuntu 10,04 y funciona correctamente.

descargar driver de la pagina oficial de D-link

http://www.dlinkla.com/home/productos/producto.jsp?idp=1307

instalar el driver como root

abrir la terminal

sudo su

descomprimir el driver en la carpeta personal.

manual o a travez de comandos.

luego instalar build essential

sudo aptitude install build-essential

despues de instalar ir a la carpeta del driver descomprimido.

cd el archivo del driver.

una vez adentro del archivo

make

luego aplicar el comando ls

luego sudo make install

después de que termina

estando como usuario de root en la terminal.

editamos este archivo con el siguiente comando.

gksu gedit /etc/modprobe.d/blacklist.conf

agregamos al final
de archivo que nos abrió.

blacklist rt2x00usb

blacklist rt2x00lib

blacklist rt2800usb

guardamos y cerramos.

desconectamos el D-link

apagamos la pc, luego pegamos el D-LINK sin encender el pc.

encendemos la pc, y solo resta crear la conexión.

listo ya debería estar navegando.

Imagen de crist_pvz
+1
0
-1

podrias explicarme un poco mas detallado ya q soy principiante y no puedo hacer funcionar el wifi ni compilar el driver

+1
0
-1
Imagen de nobody
+1
0
-1

en donde no entendiste.

+1
0
-1
Imagen de nitrosalitre
+1
0
-1

lucastt@lucastt-MS-7599:~/Descargas/2009_1204_RT3070_Linux_STA_v2.1.2.0$ make
make -C tools
make[1]: se ingresa al directorio «/home/lucastt/Descargas/2009_1204_RT3070_Linux_STA_v2.1.2.0/tools»
gcc -g bin2h.c -o bin2h
make[1]: se sale del directorio «/home/lucastt/Descargas/2009_1204_RT3070_Linux_STA_v2.1.2.0/tools»
/home/lucastt/Descargas/2009_1204_RT3070_Linux_STA_v2.1.2.0/tools/bin2h
cp -f os/linux/Makefile.6 /home/lucastt/Descargas/2009_1204_RT3070_Linux_STA_v2.1.2.0/os/linux/Makefile
make -C /lib/modules/3.2.0-25-generic/build SUBDIRS=/home/lucastt/Descargas/2009_1204_RT3070_Linux_STA_v2.1.2.0/os/linux modules
make[1]: se ingresa al directorio «/usr/src/linux-headers-3.2.0-25-generic»
CC [M] /home/lucastt/Descargas/2009_1204_RT3070_Linux_STA_v2.1.2.0/os/linux/../../common/crypt_md5.o
CC [M] /home/lucastt/Descargas/2009_1204_RT3070_Linux_STA_v2.1.2.0/os/linux/../../common/crypt_sha2.o
CC [M] /home/lucastt/Descargas/2009_1204_RT3070_Linux_STA_v2.1.2.0/os/linux/../../common/crypt_hmac.o
CC [M] /home/lucastt/Descargas/2009_1204_RT3070_Linux_STA_v2.1.2.0/os/linux/../../common/mlme.o
/home/lucastt/Descargas/2009_1204_RT3070_Linux_STA_v2.1.2.0/os/linux/../../common/mlme.c: En la función ‘BssTableSetEntry’:
/home/lucastt/Descargas/2009_1204_RT3070_Linux_STA_v2.1.2.0/os/linux/../../common/mlme.c:4004:39: aviso: la operación sobre ‘Tab->BssOverlapNr’ puede estar indefinida [-Wsequence-point]
/home/lucastt/Descargas/2009_1204_RT3070_Linux_STA_v2.1.2.0/os/linux/../../common/mlme.c: En la función ‘BssTableSortByRssi’:
/home/lucastt/Descargas/2009_1204_RT3070_Linux_STA_v2.1.2.0/os/linux/../../common/mlme.c:4408:1: aviso: el tamaño de marco de 1584 bytes es mayor que 1024 bytes [-Wframe-larger-than=]
CC [M] /home/lucastt/Descargas/2009_1204_RT3070_Linux_STA_v2.1.2.0/os/linux/../../common/cmm_wep.o
CC [M] /home/lucastt/Descargas/2009_1204_RT3070_Linux_STA_v2.1.2.0/os/linux/../../common/action.o
CC [M] /home/lucastt/Descargas/2009_1204_RT3070_Linux_STA_v2.1.2.0/os/linux/../../common/cmm_data.o
CC [M] /home/lucastt/Descargas/2009_1204_RT3070_Linux_STA_v2.1.2.0/os/linux/../../common/rtmp_init.o
/home/lucastt/Descargas/2009_1204_RT3070_Linux_STA_v2.1.2.0/os/linux/../../common/rtmp_init.c: En la función ‘RtmpRaDevCtrlInit’:
/home/lucastt/Descargas/2009_1204_RT3070_Linux_STA_v2.1.2.0/os/linux/../../common/rtmp_init.c:3710:2: error: declaración implícita de la función ‘init_MUTEX’ [-Werror=implicit-function-declaration]
/home/lucastt/Descargas/2009_1204_RT3070_Linux_STA_v2.1.2.0/os/linux/../../common/rtmp_init.c:3711:2: aviso: se pasa el argumento 2 de ‘os_alloc_mem’ desde un tipo de puntero incompatible [activado por defecto]
/home/lucastt/Descargas/2009_1204_RT3070_Linux_STA_v2.1.2.0/include/rtmp.h:5707:13: nota: se esperaba ‘UCHAR **’ pero el argumento es de tipo ‘UCHAR *’
cc1: some warnings being treated as errors
make[2]: *** [/home/lucastt/Descargas/2009_1204_RT3070_Linux_STA_v2.1.2.0/os/linux/../../common/rtmp_init.o] Error 1
make[1]: *** [_module_/home/lucastt/Descargas/2009_1204_RT3070_Linux_STA_v2.1.2.0/os/linux] Error 2
make[1]: se sale del directorio «/usr/src/linux-headers-3.2.0-25-generic»
make: *** [LINUX] Error 2

+1
0
-1
Imagen de CyborgEvil
+1
0
-1

Bajé el driver para D-Link DWA-125 Wireless 150 USB Adapter desde ftp://dlink:dlink@www.dlinkla.com/pub/drivers/DWA-125/DRIVER_LINUX_DWA-1...

Al tratar de compilarlo obtengo esto:

make[2]: *** [/home/robert0/Linux_STA/os/linux/../../common/cmm_mac_usb.o] Error 1
make[1]: *** [_module_/home/robert0/Linux_STA/os/linux] Error 2
make[1]: se sale del directorio `/usr/src/linux-headers-2.6.35-22-generic'
make: *** [LINUX] Error 2

Ayer instalé kubuntu 10.10, antes no tuve problemas para compilar e instalar el driver

¿alguna idea para solucionar este error?

Saludos

+1
0
-1
Imagen de Gral_Marko
+1
0
-1

Hola a todos, soy otro nuevo que aparece cuando las cosas no le andan.
El driver me funciono bien en la anterior version, y ahora que he instalado el 10.10 no logro compilar el driver. Tal vez falten dependencias que antes tenia instaladas. ¿alguna sugerencia?... gracias.

make -C tools
make[1]: se ingresa al directorio `/home/marco/Descargas/2009_1204_RT3070_Linux_STA_v2.1.2.0/tools'
gcc -g bin2h.c -o bin2h
make[1]: se sale del directorio `/home/marco/Descargas/2009_1204_RT3070_Linux_STA_v2.1.2.0/tools'
/home/marco/Descargas/2009_1204_RT3070_Linux_STA_v2.1.2.0/tools/bin2h
cp -f os/linux/Makefile.6 /home/marco/Descargas/2009_1204_RT3070_Linux_STA_v2.1.2.0/os/linux/Makefile
make  -C  /lib/modules/2.6.35-22-generic/build SUBDIRS=/home/marco/Descargas/2009_1204_RT3070_Linux_STA_v2.1.2.0/os/linux modules
make[1]: se ingresa al directorio `/usr/src/linux-headers-2.6.35-22-generic'
  CC [M]  /home/marco/Descargas/2009_1204_RT3070_Linux_STA_v2.1.2.0/os/linux/../../common/crypt_md5.o
  CC [M]  /home/marco/Descargas/2009_1204_RT3070_Linux_STA_v2.1.2.0/os/linux/../../common/crypt_sha2.o
  CC [M]  /home/marco/Descargas/2009_1204_RT3070_Linux_STA_v2.1.2.0/os/linux/../../common/crypt_hmac.o
  CC [M]  /home/marco/Descargas/2009_1204_RT3070_Linux_STA_v2.1.2.0/os/linux/../../common/mlme.o
/home/marco/Descargas/2009_1204_RT3070_Linux_STA_v2.1.2.0/os/linux/../../common/mlme.c: In function ‘BssTableSortByRssi’:
/home/marco/Descargas/2009_1204_RT3070_Linux_STA_v2.1.2.0/os/linux/../../common/mlme.c:4408: warning: the frame size of 1572 bytes is larger than 1024 bytes
  CC [M]  /home/marco/Descargas/2009_1204_RT3070_Linux_STA_v2.1.2.0/os/linux/../../common/cmm_wep.o
  CC [M]  /home/marco/Descargas/2009_1204_RT3070_Linux_STA_v2.1.2.0/os/linux/../../common/action.o
  CC [M]  /home/marco/Descargas/2009_1204_RT3070_Linux_STA_v2.1.2.0/os/linux/../../common/cmm_data.o
  CC [M]  /home/marco/Descargas/2009_1204_RT3070_Linux_STA_v2.1.2.0/os/linux/../../common/rtmp_init.o
/home/marco/Descargas/2009_1204_RT3070_Linux_STA_v2.1.2.0/os/linux/../../common/rtmp_init.c: In function ‘RtmpRaDevCtrlInit’:
/home/marco/Descargas/2009_1204_RT3070_Linux_STA_v2.1.2.0/os/linux/../../common/rtmp_init.c:3711: warning: passing argument 2 of ‘os_alloc_mem’ from incompatible pointer type
/home/marco/Descargas/2009_1204_RT3070_Linux_STA_v2.1.2.0/include/rtmp.h:5707: note: expected ‘UCHAR **’ but argument is of type ‘UCHAR *’
  CC [M]  /home/marco/Descargas/2009_1204_RT3070_Linux_STA_v2.1.2.0/os/linux/../../common/cmm_tkip.o
  CC [M]  /home/marco/Descargas/2009_1204_RT3070_Linux_STA_v2.1.2.0/os/linux/../../common/cmm_aes.o
/home/marco/Descargas/2009_1204_RT3070_Linux_STA_v2.1.2.0/os/linux/../../common/cmm_aes.c: In function ‘AES_GTK_KEY_WRAP’:
/home/marco/Descargas/2009_1204_RT3070_Linux_STA_v2.1.2.0/os/linux/../../common/cmm_aes.c:1338: warning: the frame size of 1092 bytes is larger than 1024 bytes
  CC [M]  /home/marco/Descargas/2009_1204_RT3070_Linux_STA_v2.1.2.0/os/linux/../../common/cmm_sync.o
  CC [M]  /home/marco/Descargas/2009_1204_RT3070_Linux_STA_v2.1.2.0/os/linux/../../common/eeprom.o
  CC [M]  /home/marco/Descargas/2009_1204_RT3070_Linux_STA_v2.1.2.0/os/linux/../../common/cmm_sanity.o
  CC [M]  /home/marco/Descargas/2009_1204_RT3070_Linux_STA_v2.1.2.0/os/linux/../../common/cmm_info.o
  CC [M]  /home/marco/Descargas/2009_1204_RT3070_Linux_STA_v2.1.2.0/os/linux/../../common/cmm_cfg.o
  CC [M]  /home/marco/Descargas/2009_1204_RT3070_Linux_STA_v2.1.2.0/os/linux/../../common/cmm_wpa.o
  CC [M]  /home/marco/Descargas/2009_1204_RT3070_Linux_STA_v2.1.2.0/os/linux/../../common/dfs.o
  CC [M]  /home/marco/Descargas/2009_1204_RT3070_Linux_STA_v2.1.2.0/os/linux/../../common/spectrum.o
  CC [M]  /home/marco/Descargas/2009_1204_RT3070_Linux_STA_v2.1.2.0/os/linux/../../common/rtmp_timer.o
  CC [M]  /home/marco/Descargas/2009_1204_RT3070_Linux_STA_v2.1.2.0/os/linux/../../common/rt_channel.o
  CC [M]  /home/marco/Descargas/2009_1204_RT3070_Linux_STA_v2.1.2.0/os/linux/../../common/cmm_profile.o
  CC [M]  /home/marco/Descargas/2009_1204_RT3070_Linux_STA_v2.1.2.0/os/linux/../../common/cmm_asic.o
  CC [M]  /home/marco/Descargas/2009_1204_RT3070_Linux_STA_v2.1.2.0/os/linux/../../common/cmm_cmd.o
  CC [M]  /home/marco/Descargas/2009_1204_RT3070_Linux_STA_v2.1.2.0/os/linux/../../sta/assoc.o
/home/marco/Descargas/2009_1204_RT3070_Linux_STA_v2.1.2.0/os/linux/../../sta/assoc.c: In function ‘wext_notify_event_assoc’:
/home/marco/Descargas/2009_1204_RT3070_Linux_STA_v2.1.2.0/os/linux/../../sta/assoc.c:1401: warning: pointer targets in passing argument 5 of ‘RtmpOSWrielessEventSend’ differ in signedness
/home/marco/Descargas/2009_1204_RT3070_Linux_STA_v2.1.2.0/include/rtmp.h:7051: note: expected ‘PUCHAR’ but argument is of type ‘char *’
  CC [M]  /home/marco/Descargas/2009_1204_RT3070_Linux_STA_v2.1.2.0/os/linux/../../sta/auth.o
  CC [M]  /home/marco/Descargas/2009_1204_RT3070_Linux_STA_v2.1.2.0/os/linux/../../sta/auth_rsp.o
  CC [M]  /home/marco/Descargas/2009_1204_RT3070_Linux_STA_v2.1.2.0/os/linux/../../sta/sync.o
/home/marco/Descargas/2009_1204_RT3070_Linux_STA_v2.1.2.0/os/linux/../../sta/sync.c: In function ‘PeerBeaconAtScanAction’:
/home/marco/Descargas/2009_1204_RT3070_Linux_STA_v2.1.2.0/os/linux/../../sta/sync.c:657: warning: the frame size of 1252 bytes is larger than 1024 bytes
/home/marco/Descargas/2009_1204_RT3070_Linux_STA_v2.1.2.0/os/linux/../../sta/sync.c: In function ‘PeerBeacon’:
/home/marco/Descargas/2009_1204_RT3070_Linux_STA_v2.1.2.0/os/linux/../../sta/sync.c:1435: warning: the frame size of 1312 bytes is larger than 1024 bytes
/home/marco/Descargas/2009_1204_RT3070_Linux_STA_v2.1.2.0/os/linux/../../sta/sync.c: In function ‘PeerBeaconAtJoinAction’:
/home/marco/Descargas/2009_1204_RT3070_Linux_STA_v2.1.2.0/os/linux/../../sta/sync.c:935: warning: the frame size of 1260 bytes is larger than 1024 bytes
/home/marco/Descargas/2009_1204_RT3070_Linux_STA_v2.1.2.0/os/linux/../../sta/sync.c: In function ‘MlmeStartReqAction’:
/home/marco/Descargas/2009_1204_RT3070_Linux_STA_v2.1.2.0/os/linux/../../sta/sync.c:525: warning: the frame size of 1064 bytes is larger than 1024 bytes
  CC [M]  /home/marco/Descargas/2009_1204_RT3070_Linux_STA_v2.1.2.0/os/linux/../../sta/sanity.o
  CC [M]  /home/marco/Descargas/2009_1204_RT3070_Linux_STA_v2.1.2.0/os/linux/../../sta/rtmp_data.o
  CC [M]  /home/marco/Descargas/2009_1204_RT3070_Linux_STA_v2.1.2.0/os/linux/../../sta/connect.o
/home/marco/Descargas/2009_1204_RT3070_Linux_STA_v2.1.2.0/os/linux/../../sta/connect.c: In function ‘LinkDown’:
/home/marco/Descargas/2009_1204_RT3070_Linux_STA_v2.1.2.0/os/linux/../../sta/connect.c:1976: warning: unused variable ‘Cancelled’
/home/marco/Descargas/2009_1204_RT3070_Linux_STA_v2.1.2.0/os/linux/../../sta/connect.c: In function ‘CntlOidScanProc’:
/home/marco/Descargas/2009_1204_RT3070_Linux_STA_v2.1.2.0/os/linux/../../sta/connect.c:343: warning: the frame size of 1600 bytes is larger than 1024 bytes
  CC [M]  /home/marco/Descargas/2009_1204_RT3070_Linux_STA_v2.1.2.0/os/linux/../../sta/wpa.o
  CC [M]  /home/marco/Descargas/2009_1204_RT3070_Linux_STA_v2.1.2.0/os/linux/../../os/linux/rt_linux.o
/home/marco/Descargas/2009_1204_RT3070_Linux_STA_v2.1.2.0/os/linux/../../os/linux/rt_linux.c: In function ‘send_monitor_packets’:
/home/marco/Descargas/2009_1204_RT3070_Linux_STA_v2.1.2.0/os/linux/../../os/linux/rt_linux.c:982: warning: the frame size of 1084 bytes is larger than 1024 bytes
  CC [M]  /home/marco/Descargas/2009_1204_RT3070_Linux_STA_v2.1.2.0/os/linux/../../os/linux/rt_profile.o
  CC [M]  /home/marco/Descargas/2009_1204_RT3070_Linux_STA_v2.1.2.0/os/linux/../../os/linux/rt_main_dev.o
  CC [M]  /home/marco/Descargas/2009_1204_RT3070_Linux_STA_v2.1.2.0/os/linux/../../os/linux/sta_ioctl.o
/home/marco/Descargas/2009_1204_RT3070_Linux_STA_v2.1.2.0/os/linux/../../os/linux/sta_ioctl.c: In function ‘rt_ioctl_siwencode’:
/home/marco/Descargas/2009_1204_RT3070_Linux_STA_v2.1.2.0/os/linux/../../os/linux/sta_ioctl.c:1842: warning: suggest parentheses around operand of ‘!’ or change ‘&’ to ‘&&’ or ‘!’ to ‘~’
/home/marco/Descargas/2009_1204_RT3070_Linux_STA_v2.1.2.0/os/linux/../../os/linux/sta_ioctl.c: In function ‘RTMPIoctlRF’:
/home/marco/Descargas/2009_1204_RT3070_Linux_STA_v2.1.2.0/os/linux/../../os/linux/sta_ioctl.c:7235: warning: pointer targets in passing argument 1 of ‘strchr’ differ in signedness
/usr/src/linux-headers-2.6.35-22-generic/arch/x86/include/asm/string_32.h:27: note: expected ‘const char *’ but argument is of type ‘CHAR *’
/home/marco/Descargas/2009_1204_RT3070_Linux_STA_v2.1.2.0/os/linux/../../os/linux/sta_ioctl.c:7235: warning: pointer targets in assignment differ in signedness
/home/marco/Descargas/2009_1204_RT3070_Linux_STA_v2.1.2.0/os/linux/../../os/linux/sta_ioctl.c: In function ‘rt_ioctl_iwaplist’:
/home/marco/Descargas/2009_1204_RT3070_Linux_STA_v2.1.2.0/os/linux/../../os/linux/sta_ioctl.c:1040: warning: the frame size of 1288 bytes is larger than 1024 bytes
/home/marco/Descargas/2009_1204_RT3070_Linux_STA_v2.1.2.0/os/linux/../../os/linux/sta_ioctl.c: In function ‘rt_ioctl_siwmlme’:
/home/marco/Descargas/2009_1204_RT3070_Linux_STA_v2.1.2.0/os/linux/../../os/linux/sta_ioctl.c:2324: warning: the frame size of 1584 bytes is larger than 1024 bytes
/home/marco/Descargas/2009_1204_RT3070_Linux_STA_v2.1.2.0/os/linux/../../os/linux/sta_ioctl.c: In function ‘RTMPIoctlRF’:
/home/marco/Descargas/2009_1204_RT3070_Linux_STA_v2.1.2.0/os/linux/../../os/linux/sta_ioctl.c:7371: warning: the frame size of 2328 bytes is larger than 1024 bytes
/home/marco/Descargas/2009_1204_RT3070_Linux_STA_v2.1.2.0/os/linux/../../os/linux/sta_ioctl.c: In function ‘RTMPIoctlE2PROM’:
/home/marco/Descargas/2009_1204_RT3070_Linux_STA_v2.1.2.0/os/linux/../../os/linux/sta_ioctl.c:7187: warning: the frame size of 1348 bytes is larger than 1024 bytes
/home/marco/Descargas/2009_1204_RT3070_Linux_STA_v2.1.2.0/os/linux/../../os/linux/sta_ioctl.c: In function ‘RTMPIoctlMAC’:
/home/marco/Descargas/2009_1204_RT3070_Linux_STA_v2.1.2.0/os/linux/../../os/linux/sta_ioctl.c:6989: warning: the frame size of 1344 bytes is larger than 1024 bytes
  CC [M]  /home/marco/Descargas/2009_1204_RT3070_Linux_STA_v2.1.2.0/os/linux/../../common/ba_action.o
  CC [M]  /home/marco/Descargas/2009_1204_RT3070_Linux_STA_v2.1.2.0/os/linux/../../os/linux/usb_main_dev.o
/home/marco/Descargas/2009_1204_RT3070_Linux_STA_v2.1.2.0/os/linux/../../os/linux/usb_main_dev.c: In function ‘RTUSBWatchDog’:
/home/marco/Descargas/2009_1204_RT3070_Linux_STA_v2.1.2.0/os/linux/../../os/linux/usb_main_dev.c:743: warning: format ‘%d’ expects type ‘int’, but argument 3 has type ‘ULONG’
  CC [M]  /home/marco/Descargas/2009_1204_RT3070_Linux_STA_v2.1.2.0/os/linux/../../os/linux/rt_usb.o
  CC [M]  /home/marco/Descargas/2009_1204_RT3070_Linux_STA_v2.1.2.0/os/linux/../../common/cmm_mac_usb.o
/home/marco/Descargas/2009_1204_RT3070_Linux_STA_v2.1.2.0/os/linux/../../common/cmm_mac_usb.c: In function ‘NICInitRecv’:
/home/marco/Descargas/2009_1204_RT3070_Linux_STA_v2.1.2.0/os/linux/../../common/cmm_mac_usb.c:83: error: implicit declaration of function ‘usb_buffer_alloc’
/home/marco/Descargas/2009_1204_RT3070_Linux_STA_v2.1.2.0/os/linux/../../common/cmm_mac_usb.c:83: warning: assignment makes pointer from integer without a cast
/home/marco/Descargas/2009_1204_RT3070_Linux_STA_v2.1.2.0/os/linux/../../common/cmm_mac_usb.c:112: error: implicit declaration of function ‘usb_buffer_free’
make[2]: *** [/home/marco/Descargas/2009_1204_RT3070_Linux_STA_v2.1.2.0/os/linux/../../common/cmm_mac_usb.o] Error 1
make[1]: *** [_module_/home/marco/Descargas/2009_1204_RT3070_Linux_STA_v2.1.2.0/os/linux] Error 2
make[1]: se sale del directorio `/usr/src/linux-headers-2.6.35-22-generic'
make: *** [LINUX] Error 2
root@marco-OptiPlex:/home/marco/Descargas/2009_1204_RT3070_Linux_STA_v2.1.2.0# 

+1
0
-1
Imagen de sicruzat1954
+1
0
-1

Nobody, excelente este artículo, seguí las instrucciones tal cual y mi DWA 125 conectó de inmediato, te agradezco mucho, muy buen aporte.

Uso un Compaq Presario F564LA, se hechó a perder la tarjeta madre y no funciona la red inalámbrica, su reparación es mas cara que comprarme un notebook nuevo, pero este me sirve, para que botarlo por eso, compré la DWA 125 y con estas instrucciones volvió a ser el equipo de antes.

Saludos desde Chile

+1
0
-1
Imagen de rtufino
+1
0
-1

Hola a todos,

Seguí tu tutorial para instalar el driver en Ubuntu 10.04 y me funcionó de maravilla, pero ahora que quiero hacerlo para Ubuntu 11.04 me sale un error (muy parecido al de Marco)

tal vez tienes alguna pista para resolverlo????

+1
0
-1

Rodrigo

Imagen de Eder29
+1
0
-1

Hola comunidad! Soy nuevo en esto y me han pedido instalar Ubuntu en mi pc para realizar trabajos diversos, sin embargo tengo la d-link ya que se quemo la entrada del PCI en mi motherboard.
alguien podría explicarme lo mas explícito posible como instalarlo? Acabo de bajar la iso del 13.10. saludos y gracias!

+1
0
-1
Imagen de Jose Luis 1320
+1
0
-1

+1
0
-1

"Yo sólo se que no se nada"
-Sócrates, filósofo griego.
-Normas del foro