Instalacion RT2860

Imagen de wax_950
0 puntos

Buenas soy nuevo en ubuntu tengo instalado la version 8.04 y e trado de instalar el driver de wireless ralink RT2860 ya tengo actualizado linux-headers-generic linux-source build-essential y siempre me sale error en make.

wax@wax-desktop:~/Escritorio/RT2860$ make
make -C tools
make[1]: se ingresa al directorio `/home/wax/Escritorio/RT2860/tools'
gcc -g bin2h.c -o bin2h
make[1]: se sale del directorio `/home/wax/Escritorio/RT2860/tools'
/home/wax/Escritorio/RT2860/tools/bin2h
cp -f os/linux/Makefile.6 /home/wax/Escritorio/RT2860/os/linux/Makefile
make -C /lib/modules/2.6.24-32-generic/build SUBDIRS=/home/wax/Escritorio/RT2860/os/linux modules
make[1]: se ingresa al directorio `/usr/src/linux-headers-2.6.24-32-generic'
CC [M] /home/wax/Escritorio/RT2860/os/linux/../../common/cmm_wpa.o
/home/wax/Escritorio/RT2860/os/linux/../../common/cmm_wpa.c: En la función ‘RTMPMakeRSNIE’:
/home/wax/Escritorio/RT2860/os/linux/../../common/cmm_wpa.c:2423: aviso: declaración sin efecto
/home/wax/Escritorio/RT2860/os/linux/../../common/cmm_wpa.c:2423: error: ‘FlexibleCipher’ no se declaró aquí (primer uso en esta función)
/home/wax/Escritorio/RT2860/os/linux/../../common/cmm_wpa.c:2423: error: (Cada identificador no declarado solamente se reporta una vez
/home/wax/Escritorio/RT2860/os/linux/../../common/cmm_wpa.c:2423: error: para cada funcion en la que aparece.)
make[2]: *** [/home/wax/Escritorio/RT2860/os/linux/../../common/cmm_wpa.o] Error 1
make[1]: *** [_module_/home/wax/Escritorio/RT2860/os/linux] Error 2
make[1]: se sale del directorio `/usr/src/linux-headers-2.6.24-32-generic'
make: *** [LINUX] Error 2
wax@wax-desktop:~/Escritorio/RT2860$

Me podrian ayudar

Imagen de Jose Luis 1320
+1
0
-1

Si es muy nuevo, actualiza la versión de Ubuntu, puesto que esa versión que tienes ya no tiene soporte.

Hay una distancia enorme entre el kernel 2.6 y 3.8 -3.9

+1
0
-1

"Yo sólo se que no se nada"
-Sócrates, filósofo griego.
-Normas del foro