No logro conectar mi portátil por wifi, Ralink 3290 ( ERROR EN EL PASO 6)

Imagen de silvia nerea
0 puntos

Segui los pasos del post de Gabriel_M
Primero hice esto:

sudo su
lspci | grep -i ethernet
lspci | grep -i network
lsusb | grep -i ethernet
lsusb | grep -i network
ifconfig -a
iwconfig
lsmod | grep iwl

root@silvia:/home/silvia# lspci | grep -i ethernet
02:00.0 Ethernet controller: Realtek Semiconductor Co., Ltd. RTL8101E/RTL8102E PCI Express Fast Ethernet controller (rev 05)
root@silvia:/home/silvia# lspci | grep -i network
01:00.0 Network controller: Ralink corp. RT3290 Wireless 802.11n 1T/1R PCIe
root@silvia:/home/silvia# lsusb | grep -i ethernet
root@silvia:/home/silvia# lsusb | grep -i network
root@silvia:/home/silvia# ifconfig -a
eth0 Link encap:Ethernet direcciónHW 74:46:a0:75:8e:5b
Direc. inet:192.168.1.36 Difus.:192.168.1.255 Másc:255.255.255.0
Dirección inet6: fe80::7646:a0ff:fe75:8e5b/64 Alcance:Enlace
ACTIVO DIFUSIÓN FUNCIONANDO MULTICAST MTU:1500 Métrica:1
Paquetes RX:16369 errores:0 perdidos:0 overruns:0 frame:0
Paquetes TX:11438 errores:0 perdidos:0 overruns:0 carrier:0
colisiones:0 long.colaTX:1000
Bytes RX:20050996 (20.0 MB) TX bytes:1264003 (1.2 MB)

lo Link encap:Bucle local
Direc. inet:127.0.0.1 Másc:255.0.0.0
Dirección inet6: ::1/128 Alcance:Anfitrión
ACTIVO BUCLE FUNCIONANDO MTU:65536 Métrica:1
Paquetes RX:1125 errores:0 perdidos:0 overruns:0 frame:0
Paquetes TX:1125 errores:0 perdidos:0 overruns:0 carrier:0
colisiones:0 long.colaTX:0
Bytes RX:152093 (152.0 KB) TX bytes:152093 (152.0 KB)

wlan0 Link encap:Ethernet direcciónHW f4:b7:e2:b8:f7:f5
Direc. inet:192.168.1.38 Difus.:192.168.1.255 Másc:255.255.255.0
Dirección inet6: fe80::f6b7:e2ff:feb8:f7f5/64 Alcance:Enlace
ACTIVO DIFUSIÓN FUNCIONANDO MULTICAST MTU:1500 Métrica:1
Paquetes RX:42 errores:0 perdidos:0 overruns:0 frame:0
Paquetes TX:93 errores:0 perdidos:0 overruns:0 carrier:0
colisiones:0 long.colaTX:1000
Bytes RX:5630 (5.6 KB) TX bytes:14812 (14.8 KB)

root@silvia:/home/silvia# iwconfig
eth0 no wireless extensions.

lo no wireless extensions.

wlan0 IEEE 802.11bgn ESSID:"WLAN_043C"
Mode:Managed Frequency:2.437 GHz Access Point: 5C:33:8E:B9:04:3C
Bit Rate=120 Mb/s Tx-Power=20 dBm
Retry long limit:7 RTS thr:off Fragment thr:off
Encryption key:off
Power Management:on
Link Quality=65/70 Signal level=-45 dBm
Rx invalid nwid:0 Rx invalid crypt:0 Rx invalid frag:0
Tx excessive retries:20 Invalid misc:26 Missed beacon:0

Despues empece a seguir los pasos y todo bien hasta el 6:
6. Ir a la carpeta principal extraído (Debe ser el DPO_RT3290_LinuxSTA_V2600_20120508 carpeta) y escriba lo siguiente:

hacer
sudo make install

El problema es que al hacer make me salen errores:

silvia@silvia:~/Descargas/DPO_RT3290_LinuxSTA_V2600_20120508$ make
make -C tools
make[1]: se ingresa al directorio «/home/silvia/Descargas/DPO_RT3290_LinuxSTA_V2600_20120508/tools»
gcc -g bin2h.c -o bin2h
make[1]: se sale del directorio «/home/silvia/Descargas/DPO_RT3290_LinuxSTA_V2600_20120508/tools»
/home/silvia/Descargas/DPO_RT3290_LinuxSTA_V2600_20120508/tools/bin2h
cp -f os/linux/Makefile.6 /home/silvia/Descargas/DPO_RT3290_LinuxSTA_V2600_20120508/os/linux/Makefile
make -C /lib/modules/3.11.0-13-generic/build SUBDIRS=/home/silvia/Descargas/DPO_RT3290_LinuxSTA_V2600_20120508/os/linux modules
make[1]: se ingresa al directorio «/usr/src/linux-headers-3.11.0-13-generic»
CC [M] /home/silvia/Descargas/DPO_RT3290_LinuxSTA_V2600_20120508/os/linux/../../common/rtmp_mcu.o
/home/silvia/Descargas/DPO_RT3290_LinuxSTA_V2600_20120508/os/linux/../../common/rtmp_mcu.c: In function ‘RtmpAsicSendCommandToMcu’:
/home/silvia/Descargas/DPO_RT3290_LinuxSTA_V2600_20120508/os/linux/../../common/rtmp_mcu.c:464:8: warning: unused variable ‘offset’ [-Wunused-variable]
ULONG offset;
^
/home/silvia/Descargas/DPO_RT3290_LinuxSTA_V2600_20120508/os/linux/../../common/rtmp_mcu.c:463:8: warning: unused variable ‘Configuration’ [-Wunused-variable]
ULONG Configuration;
^
CC [M] /home/silvia/Descargas/DPO_RT3290_LinuxSTA_V2600_20120508/os/linux/../../os/linux/pci_main_dev.o
/home/silvia/Descargas/DPO_RT3290_LinuxSTA_V2600_20120508/os/linux/../../os/linux/pci_main_dev.c:43:23: error: expected ‘=’, ‘,’, ‘;’, ‘asm’ or ‘__attribute__’ before ‘rt2860_remove_one’
static VOID __devexit rt2860_remove_one(struct pci_dev *pci_dev);
^
/home/silvia/Descargas/DPO_RT3290_LinuxSTA_V2600_20120508/os/linux/../../os/linux/pci_main_dev.c:44:22: error: expected ‘=’, ‘,’, ‘;’, ‘asm’ or ‘__attribute__’ before ‘rt2860_probe’
static INT __devinit rt2860_probe(struct pci_dev *pci_dev, const struct pci_device_id *ent);
^
/home/silvia/Descargas/DPO_RT3290_LinuxSTA_V2600_20120508/os/linux/../../os/linux/pci_main_dev.c:63:46: error: expected ‘=’, ‘,’, ‘;’, ‘asm’ or ‘__attribute__’ before ‘__devinitdata’
static struct pci_device_id rt2860_pci_tbl[] __devinitdata =
^
/home/silvia/Descargas/DPO_RT3290_LinuxSTA_V2600_20120508/os/linux/../../os/linux/pci_main_dev.c:85:17: error: ‘rt2860_pci_tbl’ undeclared here (not in a function)
id_table: rt2860_pci_tbl,
^
/home/silvia/Descargas/DPO_RT3290_LinuxSTA_V2600_20120508/os/linux/../../os/linux/pci_main_dev.c:86:17: error: ‘rt2860_probe’ undeclared here (not in a function)
probe: rt2860_probe,
^
/home/silvia/Descargas/DPO_RT3290_LinuxSTA_V2600_20120508/os/linux/../../os/linux/pci_main_dev.c:88:5: error: implicit declaration of function ‘__devexit_p’ [-Werror=implicit-function-declaration]
remove: __devexit_p(rt2860_remove_one),
^
/home/silvia/Descargas/DPO_RT3290_LinuxSTA_V2600_20120508/os/linux/../../os/linux/pci_main_dev.c:88:29: error: ‘rt2860_remove_one’ undeclared here (not in a function)
remove: __devexit_p(rt2860_remove_one),
^
/home/silvia/Descargas/DPO_RT3290_LinuxSTA_V2600_20120508/os/linux/../../os/linux/pci_main_dev.c:292:24: error: expected ‘=’, ‘,’, ‘;’, ‘asm’ or ‘__attribute__’ before ‘rt2860_probe’
static INT __devinit rt2860_probe(
^
/home/silvia/Descargas/DPO_RT3290_LinuxSTA_V2600_20120508/os/linux/../../os/linux/pci_main_dev.c:463:23: error: expected ‘=’, ‘,’, ‘;’, ‘asm’ or ‘__attribute__’ before ‘rt2860_remove_one’
static VOID __devexit rt2860_remove_one(
^
In file included from /home/silvia/Descargas/DPO_RT3290_LinuxSTA_V2600_20120508/include/os/rt_linux.h:18:0,
from /home/silvia/Descargas/DPO_RT3290_LinuxSTA_V2600_20120508/include/rtmp_os.h:42,
from /home/silvia/Descargas/DPO_RT3290_LinuxSTA_V2600_20120508/include/rtmp_comm.h:56,
from /home/silvia/Descargas/DPO_RT3290_LinuxSTA_V2600_20120508/os/linux/../../os/linux/pci_main_dev.c:32:
include/linux/module.h:87:32: error: ‘__mod_pci_device_table’ aliased to undefined symbol ‘rt2860_pci_tbl’
extern const struct gtype##_id __mod_##gtype##_table \
^
include/linux/module.h:145:3: note: in expansion of macro ‘MODULE_GENERIC_TABLE’
MODULE_GENERIC_TABLE(type##_device,name)
^
/home/silvia/Descargas/DPO_RT3290_LinuxSTA_V2600_20120508/os/linux/../../os/linux/pci_main_dev.c:71:1: note: in expansion of macro ‘MODULE_DEVICE_TABLE’
MODULE_DEVICE_TABLE(pci, rt2860_pci_tbl);
^
cc1: some warnings being treated as errors
make[2]: *** [/home/silvia/Descargas/DPO_RT3290_LinuxSTA_V2600_20120508/os/linux/../../os/linux/pci_main_dev.o] Error 1
make[1]: *** [_module_/home/silvia/Descargas/DPO_RT3290_LinuxSTA_V2600_20120508/os/linux] Error 2
make[1]: se sale del directorio «/usr/src/linux-headers-3.11.0-13-generic»
make: *** [LINUX] Error 2

POR ESTO NO PUEDO SEGUIR CON LOS PASES DE make install Y LOS PASOS 7 Y 8

Imagen de Gabriel_M
+1
0
-1

... están reconocidas y funcionando:

eth0 Link encap:Ethernet direcciónHW 74:46:a0:75:8e:5b
Direc. inet:192.168.1.36 Difus.:192.168.1.255 Másc:255.255.255.0
Dirección inet6: fe80::7646:a0ff:fe75:8e5b/64 Alcance:Enlace
ACTIVO DIFUSIÓN FUNCIONANDO MULTICAST MTU:1500 Métrica:1
Paquetes RX:16369 errores:0 perdidos:0 overruns:0 frame:0
Paquetes TX:11438 errores:0 perdidos:0 overruns:0 carrier:0
colisiones:0 long.colaTX:1000
Bytes RX:20050996 (20.0 MB) TX bytes:1264003 (1.2 MB)

wlan0 Link encap:Ethernet direcciónHW f4:b7:e2:b8:f7:f5
Direc. inet:192.168.1.38 Difus.:192.168.1.255 Másc:255.255.255.0
Dirección inet6: fe80::f6b7:e2ff:feb8:f7f5/64 Alcance:Enlace
ACTIVO DIFUSIÓN FUNCIONANDO MULTICAST MTU:1500 Métrica:1
Paquetes RX:42 errores:0 perdidos:0 overruns:0 frame:0
Paquetes TX:93 errores:0 perdidos:0 overruns:0 carrier:0
colisiones:0 long.colaTX:1000
Bytes RX:5630 (5.6 KB) TX bytes:14812 (14.8 KB)

¿Qué es lo que necesitas hacer?

+1
0
-1
Imagen de silvia nerea
+1
-1
-1

La verdad es que no entiendo el codigo asi que no se porque saldra que esta reconocida, mientras hacia eso tenia el cabla de internet enchufado al portatil.

El problema que tengo es que mi tarjeta (Ralink 3290) no es detectada por ubuntu y no me puedo conectar por wifi. Vi que le pasaba a mucha gente y vi que tu habias puesto unos pasos a seguir para que funcionase, yo fui siguiendo todos pero en el paso 6 cuando tengo que compilar el archivo (es decir hacer el make en la terminal) me da error y ya no me deja hacer el sudo make install.

Que tengo que hacer?

+1
-1
-1
Imagen de Gabriel_M
+1
0
-1

wlan0 Link encap:Ethernet direcciónHW f4:b7:e2:b8:f7:f5
Direc. inet:192.168.1.38 Difus.:192.168.1.255 Másc:255.255.255.0
Dirección inet6: fe80::f6b7:e2ff:feb8:f7f5/64 Alcance:Enlace
ACTIVO DIFUSIÓN FUNCIONANDO MULTICAST MTU:1500 Métrica:1
Paquetes RX:42 errores:0 perdidos:0 overruns:0 frame:0
Paquetes TX:93 errores:0 perdidos:0 overruns:0 carrier:0
colisiones:0 long.colaTX:1000
Bytes RX:5630 (5.6 KB) TX bytes:14812 (14.8 KB)

Simplemente desconecta el cable y verifica si te comunicas por wifi

+1
0
-1
Imagen de silvia nerea
+1
-1
-1

Sigo con este problema ya que por problemas que he tenido lo he ido dejando, sigo sin conseguir conectar mi portatil a internet queria seguir estos pasos http://askubuntu.com/questions/253632/how-do-i-get-a-ralink-rt3290-wirel... pero no encuentro en la web de mediatek el driver que tengo que descargarme, podria ayudarme?

Gracias!

+1
-1
-1
Imagen de silvia nerea
+1
-1
-1

Ya encontre el driver y segui todos los pasos y me sigue dando error al hacer el paso 6, es decir,
make
sudo make install

y aunque desconecte el cable el ordenador no encuentra ninguna red wifi
como se puede solucionar?

+1
-1
-1