Problema con "make" instalando Conceptronic C54RC

Imagen de crowdot2
0 puntos

Hola,

Tengo un problemilla, no se que pasa pero estoy intentando instalar mi targeta inalambrica conceptronic c54rc y ya tengo instalados linux-headers y build-essencial, el caso es que al poner "make" me sale siempre el mismo error.Llevo tres días volviendome loco y no hay manera y yo ya no se que hacer, a ver si alguien me puede ayudar. muchas gracias de antemano. El error que me sale es el siguiente:

user@user-laptop:~/rt2500-cvs-2007031708/Module$ make
make[1]: se ingresa al directorio `/usr/src/linux-headers-2.6.17-11-generic'
CC [M] /home/user/rt2500-cvs-2007031708/Module/rtmp_main.o
/home/user/rt2500-cvs-2007031708/Module/rtmp_main.c:65: error: static declaration of ‘debug’ follows non-static declaration
/home/user/rt2500-cvs-2007031708/Module/rtmp.h:91: error: previous declaration of ‘debug’ was here
make[2]: *** [/home/user/rt2500-cvs-2007031708/Module/rtmp_main.o] Error 1
make[1]: *** [_module_/home/user/rt2500-cvs-2007031708/Module] Error 2
make[1]: se sale del directorio `/usr/src/linux-headers-2.6.17-11-generic'
rt2500.ko failed to build!
make: *** [module] Error 1
user@user-laptop:~/rt2500-cvs-2007031708/Module$

Muchas gracias a todos.

Imagen de Sagrath79
+1
0
-1

Estas 100% seguro de que tu tarjeta no es detectada por Ubuntu? Yo tengo la C54i y no he tenido que hacer prácticamente nada para que funcione. Sólo (si no recuerdo mal) configurarla con el router.

+1
0
-1
Imagen de enio
+1
0
-1

A mi me da el mismo error y no sé de que puede ser. He leido por ahí en otro foro que la solución era hacer un enlace simbólico y tal pero me seguía sin funcionar.

Este es mi error, exáctamente clavado al tuyo.

enio@enio-desktop:~/rt2500-cvs-2007032109/Module$ make
make[1]: se ingresa al directorio `/usr/src/linux-headers-2.6.15-23-amd64-generic'
CC [M] /home/enio/rt2500-cvs-2007032109/Module/rtmp_main.o
/home/enio/rt2500-cvs-2007032109/Module/rtmp_main.c:65: error: la declaración static de ‘debug’ a continuación de una no static
/home/enio/rt2500-cvs-2007032109/Module/rtmp.h:91: error: la declaración previa de ‘debug’ estaba aquí
make[2]: *** [/home/enio/rt2500-cvs-2007032109/Module/rtmp_main.o] Error 1
make[1]: *** [_module_/home/enio/rt2500-cvs-2007032109/Module] Error 2
make[1]: se sale del directorio `/usr/src/linux-headers-2.6.15-23-amd64-generic'
rt2500.ko failed to build!
make: *** [module] Error 1

+1
0
-1