Problema con el PSX emulator

Imagen de spectrumpac
0 puntos

Baje el psx emulator y pues funciona el problema es que corre tan lento que apenas puede correr el bios y lo corre todo entrecortado no se si sera problema del psx o del driver de video que tengo, Mi computadora es una Gateway Solo 1450 biene con el chip Intel(R) 82830M busque el driver en intel pero solo me aparece uno para kerner 2.4.x y mi kernel es un 2.6.x estoy utilizan Kunbuntu 7.04 actualmente estoy utilizando el gestor de ventanas de Gnome cuando usaba windows usaba el ePSXe y me funcionaba bien pude jugar FFVIII y ahora quiero jugar FFIX pero ni el ePSXe ni el PSX emu me funcionan talvez alguien puede Ayudarme.

Saludos y Gracias de Antemano 

Imagen de spectrumpac
+1
0
-1

Aqui les dejo el Log que me dio la instalacion del driver cuando lo intente hacer.

 

rm -f *.o
rm -f linux
rm -f version.h
rm -f autoconf.h
rm -f testgart
Error: cannot find header matching kernel version 2.6.20-15-generic
=== Running kernel version: 2.6.20-15-generic
=== Kernel headers in /lib/modules/2.6.20-15-generic/build/include
=== SMP= MODULES= MODVERSIONS=
=== Compiling for machine
rm -f linux
ln -s . linux
cc -O2 -Wall -Wwrite-strings -Wpointer-arith -Wcast-align -Wstrict-prototypes -Wnested-externs -Wpointer-arith -D__KERNEL__ -DMODULE -fomit-frame-pointer -DEXPORT_SYMTAB -I. -I/lib/modules/2.6.20-15-generic/build/include -c agpgart_be.c -o agpgart_be.o
agpgart_be.c:36:26: error: linux/config.h: No existe el fichero ó directorio
In file included from /lib/modules/2.6.20-15-generic/build/include/asm/thread_info.h:16,
                 from /lib/modules/2.6.20-15-generic/build/include/linux/thread_info.h:21,
                 from /lib/modules/2.6.20-15-generic/build/include/linux/preempt.h:9,
                 from /lib/modules/2.6.20-15-generic/build/include/linux/spinlock.h:49,
                 from /lib/modules/2.6.20-15-generic/build/include/linux/module.h:9,
                 from agpgart_be.c:38:
/lib/modules/2.6.20-15-generic/build/include/asm/processor.h:82: error: ‘CONFIG_X86_L1_CACHE_SHIFT’ no se declaró aquí (no en una función)
/lib/modules/2.6.20-15-generic/build/include/asm/processor.h:82: error: la alineación solicitada no es una constante
/lib/modules/2.6.20-15-generic/build/include/asm/processor.h: En la función ‘cpuid_count’:
/lib/modules/2.6.20-15-generic/build/include/asm/processor.h:611: aviso: el puntero que apunta en el paso del argumento 1 de ‘native_cpuid’ difiere en signo
/lib/modules/2.6.20-15-generic/build/include/asm/processor.h:611: aviso: el puntero que apunta en el paso del argumento 2 de ‘native_cpuid’ difiere en signo
/lib/modules/2.6.20-15-generic/build/include/asm/processor.h:611: aviso: el puntero que apunta en el paso del argumento 3 de ‘native_cpuid’ difiere en signo
/lib/modules/2.6.20-15-generic/build/include/asm/processor.h:611: aviso: el puntero que apunta en el paso del argumento 4 de ‘native_cpuid’ difiere en signo
In file included from /lib/modules/2.6.20-15-generic/build/include/linux/list.h:8,
                 from /lib/modules/2.6.20-15-generic/build/include/linux/module.h:10,
                 from agpgart_be.c:38:
/lib/modules/2.6.20-15-generic/build/include/linux/prefetch.h: En la función ‘prefetch_range’:
/lib/modules/2.6.20-15-generic/build/include/linux/prefetch.h:62: aviso: se usó un puntero de tipo ‘void *’ en la aritmética
En el fichero incluído de /lib/modules/2.6.20-15-generic/build/include/linux/sched.h:51,
                 de /lib/modules/2.6.20-15-generic/build/include/linux/utsname.h:35,
                 de /lib/modules/2.6.20-15-generic/build/include/asm/elf.h:12,
                 de /lib/modules/2.6.20-15-generic/build/include/linux/elf.h:7,
                 de /lib/modules/2.6.20-15-generic/build/include/linux/module.h:15,
                 de agpgart_be.c:38:
/lib/modules/2.6.20-15-generic/build/include/linux/jiffies.h:33:3: error: #error You lose.
/lib/modules/2.6.20-15-generic/build/include/linux/jiffies.h:225:31: error: división por cero en #if
/lib/modules/2.6.20-15-generic/build/include/linux/jiffies.h:225:31: error: división por cero en #if
/lib/modules/2.6.20-15-generic/build/include/linux/jiffies.h:225:31: error: división por cero en #if
/lib/modules/2.6.20-15-generic/build/include/linux/jiffies.h:225:31: error: división por cero en #if
/lib/modules/2.6.20-15-generic/build/include/linux/jiffies.h:225:31: error: división por cero en #if
/lib/modules/2.6.20-15-generic/build/include/linux/jiffies.h:225:31: error: división por cero en #if
/lib/modules/2.6.20-15-generic/build/include/linux/jiffies.h:225:31: error: división por cero en #if
/lib/modules/2.6.20-15-generic/build/include/linux/jiffies.h:225:31: error: división por cero en #if
/lib/modules/2.6.20-15-generic/build/include/linux/jiffies.h:225:31: error: división por cero en #if
/lib/modules/2.6.20-15-generic/build/include/linux/jiffies.h:225:31: error: división por cero en #if
/lib/modules/2.6.20-15-generic/build/include/linux/jiffies.h:225:31: error: división por cero en #if
/lib/modules/2.6.20-15-generic/build/include/linux/jiffies.h:225:31: error: división por cero en #if
/lib/modules/2.6.20-15-generic/build/include/linux/jiffies.h:225:31: error: división por cero en #if
/lib/modules/2.6.20-15-generic/build/include/linux/jiffies.h:225:31: error: división por cero en #if
/lib/modules/2.6.20-15-generic/build/include/linux/jiffies.h:225:31: error: división por cero en #if
/lib/modules/2.6.20-15-generic/build/include/linux/jiffies.h:225:31: error: división por cero en #if
/lib/modules/2.6.20-15-generic/build/include/linux/jiffies.h:269:46: error: división por cero en #if
In file included from /lib/modules/2.6.20-15-generic/build/include/linux/sched.h:51,
                 from /lib/modules/2.6.20-15-generic/build/include/linux/utsname.h:35,
                 from /lib/modules/2.6.20-15-generic/build/include/asm/elf.h:12,
                 from /lib/modules/2.6.20-15-generic/build/include/linux/elf.h:7,
                 from /lib/modules/2.6.20-15-generic/build/include/linux/module.h:15,
                 from agpgart_be.c:38:
/lib/modules/2.6.20-15-generic/build/include/linux/jiffies.h: En la función ‘jiffies_to_msecs’:
/lib/modules/2.6.20-15-generic/build/include/linux/jiffies.h:274: error: ‘CONFIG_HZ’ no se declaró aquí (primer uso en esta función)
/lib/modules/2.6.20-15-generic/build/include/linux/jiffies.h:274: error: (Cada identificador no declarado solamente se reporta una vez
/lib/modules/2.6.20-15-generic/build/include/linux/jiffies.h:274: error: ara cada funcion en la que aparece.)
/lib/modules/2.6.20-15-generic/build/include/linux/jiffies.h:280:46: error: división por cero en #if
/lib/modules/2.6.20-15-generic/build/include/linux/jiffies.h: En la función ‘jiffies_to_usecs’:
/lib/modules/2.6.20-15-generic/build/include/linux/jiffies.h:285: error: ‘CONFIG_HZ’ no se declaró aquí (primer uso en esta función)
/lib/modules/2.6.20-15-generic/build/include/linux/jiffies.h:293:46: error: división por cero en #if
/lib/modules/2.6.20-15-generic/build/include/linux/jiffies.h: En la función ‘msecs_to_jiffies’:
/lib/modules/2.6.20-15-generic/build/include/linux/jiffies.h:298: error: ‘CONFIG_HZ’ no se declaró aquí (primer uso en esta función)
/lib/modules/2.6.20-15-generic/build/include/linux/jiffies.h:306:46: error: división por cero en #if
/lib/modules/2.6.20-15-generic/build/include/linux/jiffies.h: En la función ‘usecs_to_jiffies’:
/lib/modules/2.6.20-15-generic/build/include/linux/jiffies.h:311: error: ‘CONFIG_HZ’ no se declaró aquí (primer uso en esta función)
/lib/modules/2.6.20-15-generic/build/include/linux/jiffies.h: En la función ‘timespec_to_jiffies’:
/lib/modules/2.6.20-15-generic/build/include/linux/jiffies.h:330: error: ‘CONFIG_HZ’ no se declaró aquí (primer uso en esta función)
/lib/modules/2.6.20-15-generic/build/include/linux/jiffies.h:336: error: ‘SHIFT_HZ’ no se declaró aquí (primer uso en esta función)
/lib/modules/2.6.20-15-generic/build/include/linux/jiffies.h: En la función ‘jiffies_to_timespec’:
/lib/modules/2.6.20-15-generic/build/include/linux/jiffies.h:349: error: ‘CONFIG_HZ’ no se declaró aquí (primer uso en esta función)
/lib/modules/2.6.20-15-generic/build/include/linux/jiffies.h: En la función ‘timeval_to_jiffies’:
/lib/modules/2.6.20-15-generic/build/include/linux/jiffies.h:371: error: ‘CONFIG_HZ’ no se declaró aquí (primer uso en esta función)
/lib/modules/2.6.20-15-generic/build/include/linux/jiffies.h:375: error: ‘SHIFT_HZ’ no se declaró aquí (primer uso en esta función)
/lib/modules/2.6.20-15-generic/build/include/linux/jiffies.h: En la función ‘jiffies_to_timeval’:
/lib/modules/2.6.20-15-generic/build/include/linux/jiffies.h:387: error: ‘CONFIG_HZ’ no se declaró aquí (primer uso en esta función)
/lib/modules/2.6.20-15-generic/build/include/linux/jiffies.h:400:6: error: división por cero en #if
/lib/modules/2.6.20-15-generic/build/include/linux/jiffies.h:400:6: error: división por cero en #if
/lib/modules/2.6.20-15-generic/build/include/linux/jiffies.h:400:6: error: división por cero en #if
/lib/modules/2.6.20-15-generic/build/include/linux/jiffies.h:400:6: error: división por cero en #if
/lib/modules/2.6.20-15-generic/build/include/linux/jiffies.h:400:6: error: división por cero en #if
/lib/modules/2.6.20-15-generic/build/include/linux/jiffies.h:400:6: error: división por cero en #if
/lib/modules/2.6.20-15-generic/build/include/linux/jiffies.h:400:6: error: división por cero en #if
/lib/modules/2.6.20-15-generic/build/include/linux/jiffies.h:400:6: error: división por cero en #if
/lib/modules/2.6.20-15-generic/build/include/linux/jiffies.h:400:6: error: división por cero en #if
/lib/modules/2.6.20-15-generic/build/include/linux/jiffies.h:400:6: error: división por cero en #if
/lib/modules/2.6.20-15-generic/build/include/linux/jiffies.h:400:6: error: división por cero en #if
/lib/modules/2.6.20-15-generic/build/include/linux/jiffies.h:400:6: error: división por cero en #if
/lib/modules/2.6.20-15-generic/build/include/linux/jiffies.h:400:6: error: división por cero en #if
/lib/modules/2.6.20-15-generic/build/include/linux/jiffies.h:400:6: error: división por cero en #if
/lib/modules/2.6.20-15-generic/build/include/linux/jiffies.h:400:6: error: división por cero en #if
/lib/modules/2.6.20-15-generic/build/include/linux/jiffies.h:400:6: error: división por cero en #if
/lib/modules/2.6.20-15-generic/build/include/linux/jiffies.h: En la función ‘jiffies_to_clock_t’:
/lib/modules/2.6.20-15-generic/build/include/linux/jiffies.h:401: error: ‘CONFIG_HZ’ no se declaró aquí (primer uso en esta función)
/lib/modules/2.6.20-15-generic/build/include/linux/jiffies.h: En la función ‘clock_t_to_jiffies’:
/lib/modules/2.6.20-15-generic/build/include/linux/jiffies.h:412: error: ‘CONFIG_HZ’ no se declaró aquí (primer uso en esta función)
/lib/modules/2.6.20-15-generic/build/include/linux/jiffies.h:431:6: error: división por cero en #if
/lib/modules/2.6.20-15-generic/build/include/linux/jiffies.h:431:6: error: división por cero en #if
/lib/modules/2.6.20-15-generic/build/include/linux/jiffies.h:431:6: error: división por cero en #if
/lib/modules/2.6.20-15-generic/build/include/linux/jiffies.h:431:6: error: división por cero en #if
/lib/modules/2.6.20-15-generic/build/include/linux/jiffies.h:431:6: error: división por cero en #if
/lib/modules/2.6.20-15-generic/build/include/linux/jiffies.h:431:6: error: división por cero en #if
/lib/modules/2.6.20-15-generic/build/include/linux/jiffies.h:431:6: error: división por cero en #if
/lib/modules/2.6.20-15-generic/build/include/linux/jiffies.h:431:6: error: división por cero en #if
/lib/modules/2.6.20-15-generic/build/include/linux/jiffies.h:431:6: error: división por cero en #if
/lib/modules/2.6.20-15-generic/build/include/linux/jiffies.h:431:6: error: división por cero en #if
/lib/modules/2.6.20-15-generic/build/include/linux/jiffies.h:431:6: error: división por cero en #if
/lib/modules/2.6.20-15-generic/build/include/linux/jiffies.h:431:6: error: división por cero en #if
/lib/modules/2.6.20-15-generic/build/include/linux/jiffies.h:431:6: error: división por cero en #if
/lib/modules/2.6.20-15-generic/build/include/linux/jiffies.h:431:6: error: división por cero en #if
/lib/modules/2.6.20-15-generic/build/include/linux/jiffies.h:431:6: error: división por cero en #if
/lib/modules/2.6.20-15-generic/build/include/linux/jiffies.h:431:6: error: división por cero en #if
/lib/modules/2.6.20-15-generic/build/include/linux/jiffies.h: En la función ‘jiffies_64_to_clock_t’:
/lib/modules/2.6.20-15-generic/build/include/linux/jiffies.h:432: error: ‘CONFIG_HZ’ no se declaró aquí (primer uso en esta función)
In file included from /lib/modules/2.6.20-15-generic/build/include/linux/sched.h:67,
                 from /lib/modules/2.6.20-15-generic/build/include/linux/utsname.h:35,
                 from /lib/modules/2.6.20-15-generic/build/include/asm/elf.h:12,
                 from /lib/modules/2.6.20-15-generic/build/include/linux/elf.h:7,
                 from /lib/modules/2.6.20-15-generic/build/include/linux/module.h:15,
                 from agpgart_be.c:38:
/lib/modules/2.6.20-15-generic/build/include/linux/signal.h: En la función ‘sigisemptyset’:
/lib/modules/2.6.20-15-generic/build/include/linux/signal.h:75: aviso: declaración externa anidada de ‘_NSIG_WORDS_is_unsupported_size’
/lib/modules/2.6.20-15-generic/build/include/linux/signal.h: En la función ‘sigorsets’:
/lib/modules/2.6.20-15-generic/build/include/linux/signal.h:120: aviso: declaración externa anidada de ‘_NSIG_WORDS_is_unsupported_size’
/lib/modules/2.6.20-15-generic/build/include/linux/signal.h: En la función ‘sigandsets’:
/lib/modules/2.6.20-15-generic/build/include/linux/signal.h:123: aviso: declaración externa anidada de ‘_NSIG_WORDS_is_unsupported_size’
/lib/modules/2.6.20-15-generic/build/include/linux/signal.h: En la función ‘signandsets’:
/lib/modules/2.6.20-15-generic/build/include/linux/signal.h:126: aviso: declaración externa anidada de ‘_NSIG_WORDS_is_unsupported_size’
/lib/modules/2.6.20-15-generic/build/include/linux/signal.h: En la función ‘signotset’:
/lib/modules/2.6.20-15-generic/build/include/linux/signal.h:150: aviso: declaración externa anidada de ‘_NSIG_WORDS_is_unsupported_size’
In file included from /lib/modules/2.6.20-15-generic/build/include/linux/aio.h:5,
                 from /lib/modules/2.6.20-15-generic/build/include/linux/sched.h:260,
                 from /lib/modules/2.6.20-15-generic/build/include/linux/utsname.h:35,
                 from /lib/modules/2.6.20-15-generic/build/include/asm/elf.h:12,
                 from /lib/modules/2.6.20-15-generic/build/include/linux/elf.h:7,
                 from /lib/modules/2.6.20-15-generic/build/include/linux/module.h:15,
                 from agpgart_be.c:38:
/lib/modules/2.6.20-15-generic/build/include/linux/workqueue.h: En la función ‘cancel_delayed_work’:
/lib/modules/2.6.20-15-generic/build/include/linux/workqueue.h:203: aviso: la dereferencia de punteros de tipo castigado romperá las reglas de alias estricto
In file included from /lib/modules/2.6.20-15-generic/build/include/linux/utsname.h:35,
                 from /lib/modules/2.6.20-15-generic/build/include/asm/elf.h:12,
                 from /lib/modules/2.6.20-15-generic/build/include/linux/elf.h:7,
                 from /lib/modules/2.6.20-15-generic/build/include/linux/module.h:15,
                 from agpgart_be.c:38:
/lib/modules/2.6.20-15-generic/build/include/linux/sched.h: En la función ‘dequeue_signal_lock’:
/lib/modules/2.6.20-15-generic/build/include/linux/sched.h:1309: aviso: declaración implícita de la función ‘local_irq_save’
/lib/modules/2.6.20-15-generic/build/include/linux/sched.h:1309: aviso: declaración externa anidada de ‘local_irq_save’
/lib/modules/2.6.20-15-generic/build/include/linux/sched.h:1311: aviso: declaración implícita de la función ‘local_irq_restore’
/lib/modules/2.6.20-15-generic/build/include/linux/sched.h:1311: aviso: declaración externa anidada de ‘local_irq_restore’
En el fichero incluído de /lib/modules/2.6.20-15-generic/build/include/linux/module.h:21,
                 de agpgart_be.c:38:
/lib/modules/2.6.20-15-generic/build/include/asm/module.h:62:2: error: #error unknown processor family
In file included from agpgart_be.c:42:
/lib/modules/2.6.20-15-generic/build/include/linux/mm.h: En la función ‘lowmem_page_address’:
/lib/modules/2.6.20-15-generic/build/include/linux/mm.h:539: aviso: declaración implícita de la función ‘__page_to_pfn’
/lib/modules/2.6.20-15-generic/build/include/linux/mm.h:539: aviso: declaración externa anidada de ‘__page_to_pfn’
/lib/modules/2.6.20-15-generic/build/include/linux/mm.h:539: error: ‘CONFIG_PAGE_OFFSET’ no se declaró aquí (primer uso en esta función)
In file included from /lib/modules/2.6.20-15-generic/build/include/asm/pci.h:41,
                 from /lib/modules/2.6.20-15-generic/build/include/linux/pci.h:746,
                 from agpgart_be.c:47:
/lib/modules/2.6.20-15-generic/build/include/asm/io.h: En la función ‘virt_to_phys’:
/lib/modules/2.6.20-15-generic/build/include/asm/io.h:77: error: ‘CONFIG_PAGE_OFFSET’ no se declaró aquí (primer uso en esta función)
/lib/modules/2.6.20-15-generic/build/include/asm/io.h: En la función ‘phys_to_virt’:
/lib/modules/2.6.20-15-generic/build/include/asm/io.h:95: error: ‘CONFIG_PAGE_OFFSET’ no se declaró aquí (primer uso en esta función)
In file included from /lib/modules/2.6.20-15-generic/build/include/linux/pci.h:746,
                 from agpgart_be.c:47:
/lib/modules/2.6.20-15-generic/build/include/asm/pci.h: En la función ‘pci_dac_dma_to_page’:
/lib/modules/2.6.20-15-generic/build/include/asm/pci.h:72: aviso: declaración implícita de la función ‘__pfn_to_page’
/lib/modules/2.6.20-15-generic/build/include/asm/pci.h:72: aviso: declaración externa anidada de ‘__pfn_to_page’
/lib/modules/2.6.20-15-generic/build/include/asm/pci.h:72: aviso: la devolución crea un puntero desde un entero sin una conversión
agpgart_be.c: En el nivel principal:
agpgart_be.c:79: error: expected ‘)’ before string constant
agpgart_be.c: En la función ‘agp_backend_acquire’:
agpgart_be.c:161: error: ‘MOD_INC_USE_COUNT’ no se declaró aquí (primer uso en esta función)
agpgart_be.c: En la función ‘agp_backend_release’:
agpgart_be.c:171: error: ‘MOD_DEC_USE_COUNT’ no se declaró aquí (primer uso en esta función)
agpgart_be.c: En la función ‘agp_free_memory’:
agpgart_be.c:264: error: ‘MOD_DEC_USE_COUNT’ no se declaró aquí (primer uso en esta función)
agpgart_be.c: En la función ‘agp_allocate_memory’:
agpgart_be.c:291: error: ‘MOD_INC_USE_COUNT’ no se declaró aquí (primer uso en esta función)
agpgart_be.c:298: error: ‘MOD_DEC_USE_COUNT’ no se declaró aquí (primer uso en esta función)
agpgart_be.c: En la función ‘agp_generic_agp_enable’:
agpgart_be.c:492: aviso: declaración implícita de la función ‘pci_for_each_dev’
agpgart_be.c:492: aviso: declaración externa anidada de ‘pci_for_each_dev’
agpgart_be.c:492: error: expected ‘;’ before ‘{’ token
agpgart_be.c:562: error: expected ‘;’ before ‘{’ token
agpgart_be.c:480: aviso: variable ‘cap_ptr’ sin usar
agpgart_be.c:479: aviso: variable ‘scratch’ sin usar
agpgart_be.c: En la función ‘agp_generic_create_gatt_table’:
agpgart_be.c:660: error: ‘CONFIG_PAGE_OFFSET’ no se declaró aquí (primer uso en esta función)
agpgart_be.c:660: aviso: la asignación crea un puntero desde un entero sin una conversión
agpgart_be.c:660: aviso: comparación entre puntero y entero
agpgart_be.c:670: aviso: la asignación crea un puntero desde un entero sin una conversión
agpgart_be.c:670: aviso: comparación entre puntero y entero
agpgart_be.c: En la función ‘agp_generic_free_gatt_table’:
agpgart_be.c:737: error: ‘CONFIG_PAGE_OFFSET’ no se declaró aquí (primer uso en esta función)
agpgart_be.c:737: aviso: la asignación crea un puntero desde un entero sin una conversión
agpgart_be.c:737: aviso: comparación entre puntero y entero
agpgart_be.c: En la función ‘agp_generic_destroy_page’:
agpgart_be.c:866: error: ‘CONFIG_PAGE_OFFSET’ no se declaró aquí (primer uso en esta función)
agpgart_be.c:866: aviso: la asignación crea un puntero desde un entero sin una conversión
agpgart_be.c: En la función ‘intel_i810_alloc_by_type’:
agpgart_be.c:1072: error: ‘MOD_INC_USE_COUNT’ no se declaró aquí (primer uso en esta función)
agpgart_be.c: En la función ‘intel_i810_free_by_type’:
agpgart_be.c:1120: error: ‘MOD_DEC_USE_COUNT’ no se declaró aquí (primer uso en esta función)
agpgart_be.c: En la función ‘intel_i830_alloc_by_type’:
agpgart_be.c:1451: error: ‘MOD_INC_USE_COUNT’ no se declaró aquí (primer uso en esta función)
agpgart_be.c: En la función ‘intel_855gm_alloc_by_type’:
agpgart_be.c:1795: error: ‘MOD_INC_USE_COUNT’ no se declaró aquí (primer uso en esta función)
agpgart_be.c: En la función ‘agp_find_supported_device’:
agpgart_be.c:4813: aviso: declaración implícita de la función ‘pci_find_class’
agpgart_be.c:4813: aviso: declaración externa anidada de ‘pci_find_class’
agpgart_be.c:4813: aviso: la asignación crea un puntero desde un entero sin una conversión
agpgart_be.c: En la función ‘agp_init’:
agpgart_be.c:5275: aviso: declaración implícita de la función ‘inter_module_register’
agpgart_be.c:5275: aviso: declaración externa anidada de ‘inter_module_register’
agpgart_be.c:5277: aviso: declaración implícita de la función ‘pm_register’
agpgart_be.c:5277: aviso: declaración externa anidada de ‘pm_register’
agpgart_be.c: En la función ‘agp_cleanup’:
agpgart_be.c:5283: aviso: declaración implícita de la función ‘pm_unregister_all’
agpgart_be.c:5283: aviso: declaración externa anidada de ‘pm_unregister_all’
agpgart_be.c:5286: aviso: declaración implícita de la función ‘inter_module_unregister’
agpgart_be.c:5286: aviso: declaración externa anidada de ‘inter_module_unregister’
make: *** [agpgart_be.o] Error 1
rm -f *.o *.a *~ core
rm -f linux
rm -f version.h
rm -f autoconf.h
make: *** No hay ninguna regla para construir el objetivo `i830.o'.  Alto.

+1
0
-1
Imagen de hugolino
+1
0
-1

Este línea:

"Error: cannot find header matching kernel version 2.6.20-15-generic"

dice que te faltan los headers de tu kernel, buscá en synaptic algo como "linux-kernel-headers-2.6.20.15-generic" (algo así se llama el paquete, pero no estoy del todo seguro, buscale bien que tiene que estar)

Seguramente con eso se te solucionan muchos de esos errores que dicen que hay cosas no definidas (que deberían estar definidas en los headers esos)

+1
0
-1
Imagen de spectrumpac
+1
0
-1

Pues les dejo esta foto para que vean, yo creo que si tengo instalados todos los headers creo que debe de ser otro problema.

Pantallazo.png 

+1
0
-1