Instalar iDVR en Hardy Heron

Imagen de Classic
0 puntos

hola, estoy intentando instalar iDVR para manejo de camara ip, viene comprimido en tar.gz.
Todo va bien hasta el momento de hacer el make, donde me tira los siquientes errores:
make all-recursive
make[1]: se ingresa al directorio `/home/ubuntu/devsec-3.0.6'
Making all in dtk
make[2]: se ingresa al directorio `/home/ubuntu/devsec-3.0.6/dtk'
make all-recursive
make[3]: se ingresa al directorio `/home/ubuntu/devsec-3.0.6/dtk'
Making all in include
make[4]: se ingresa al directorio `/home/ubuntu/devsec-3.0.6/dtk/include'
make[4]: No se hace nada para `all'.
make[4]: se sale del directorio `/home/ubuntu/devsec-3.0.6/dtk/include'
Making all in lib
make[4]: se ingresa al directorio `/home/ubuntu/devsec-3.0.6/dtk/lib'
if /bin/bash ../libtool --tag=CXX --mode=compile g++ -DHAVE_CONFIG_H -I. -I. -I.. -I../include -I/usr/X11R6/include -g -O2 -MT libdtk_la-button.lo -MD -MP -MF ".deps/libdtk_la-button.Tpo" -c -o libdtk_la-button.lo `test -f 'button.cpp' || echo './'`button.cpp; \
then mv -f ".deps/libdtk_la-button.Tpo" ".deps/libdtk_la-button.Plo"; else rm -f ".deps/libdtk_la-button.Tpo"; exit 1; fi
g++ -DHAVE_CONFIG_H -I. -I. -I.. -I../include -I/usr/X11R6/include -g -O2 -MT libdtk_la-button.lo -MD -MP -MF .deps/libdtk_la-button.Tpo -c button.cpp -fPIC -DPIC -o .libs/libdtk_la-button.o
En el fichero incluído de ../include/dtk_skin.h:7,
de button.cpp:9:
../include/skin_interface.h:6:21: error: X11/xpm.h: No existe el fichero ó directorio
button.cpp: In member function ‘virtual int Button::HandleKeyRelease(XEvent*)’:
button.cpp:276: error: ‘XLookupString’ no se declaró en este ámbito
make[4]: *** [libdtk_la-button.lo] Error 1
make[4]: se sale del directorio `/home/ubuntu/devsec-3.0.6/dtk/lib'
make[3]: *** [all-recursive] Error 1
make[3]: se sale del directorio `/home/ubuntu/devsec-3.0.6/dtk'
make[2]: *** [all] Error 2
make[2]: se sale del directorio `/home/ubuntu/devsec-3.0.6/dtk'
make[1]: *** [all-recursive] Error 1
make[1]: se sale del directorio `/home/ubuntu/devsec-3.0.6'
make: *** [all] Error 2
-------------------------------------------------------------------------------------------------------------------------

Estuve buscando y lei que puede ser un problema con "-Werror".
Bueno cualquier otra cosa que necesiten voy a tratar de especificarlo.
desde ya muchas gracias.